{"text_format":"3","workbook":"xlsx","n_sheets":6,"sheets":["Ajuda","Definições","Atletismo","Totais","Classif. Final","Folha1"],"not_rendered":{"images":7,"defined_names":11},"read":"whole","date_system":"1900"}

{"sheet":"Ajuda","index":0,"n_rows":28,"n_cols":30,"rows_kept":28,"merged":[[2,0,3,0],[2,2,3,38],[4,0,5,0],[6,0,7,0],[6,4,7,27],[6,29,9,38],[8,0,9,0],[9,3,9,27],[10,0,11,0],[10,3,10,27],[11,3,11,27],[11,29,11,38],[12,3,12,27],[12,29,12,38],[13,29,13,38],[14,0,15,0],[14,3,14,27],[14,29,14,38],[15,3,15,27],[16,3,17,27],[16,29,16,38],[17,29,17,38],[18,3,18,27],[18,29,18,38],[19,3,20,27],[19,29,19,38],[21,3,21,28],[21,29,21,38],[22,29,22,38],[23,14,23,27],[23,29,23,38],[24,29,24,38],[25,13,25,27],[25,29,25,38],[26,3,27,12],[26,29,26,38],[27,29,27,38]]}
[]
[]
["AJUDA",null,"Taça Desporto Escolar"]
[]
["DEFINIÇÕES"]
[]
["ATLETISMO",{"$nulls":3},{"$f":"IF(Definições!AC4=\"\",\"\",IF(OR(Definições!AC4<Folha1!B2,Definições!AC4>Folha1!B11),\"\",UPPER(VLOOKUP(Definições!AC4,Folha1!B2:C11,2,FALSE)))&\" TAÇA DO DESPORTO ESCOLAR\")","v":"III TAÇA DO DESPORTO ESCOLAR"},{"$nulls":24},"Se tiver dúvidas no preenchimento deste documento, entre em contacto com os seguintes responsáveis."]
[]
{"$rows_left_out":21}
{"sheet":"Definições","index":1,"n_rows":30,"n_cols":48,"rows_kept":30,"merged":[[0,7,0,36],[1,7,2,14],[1,16,2,26],[1,29,2,36],[2,0,3,0],[3,7,4,14],[3,16,4,26],[3,28,4,31],[3,32,4,32],[3,33,4,36],[4,0,5,0],[6,0,7,0],[6,3,6,5],[6,7,6,14],[6,15,6,36],[7,3,7,5],[7,7,7,14],[7,15,7,36],[8,0,9,0],[8,3,8,5],[8,7,8,14],[8,15,8,36],[9,3,9,5],[9,7,9,14],[9,15,9,36],[10,0,11,0],[10,3,10,5],[10,7,10,14],[10,15,10,36],[11,3,11,5],[11,7,11,14],[11,15,11,36],[12,3,12,5],[12,7,12,14],[12,15,12,36],[13,3,13,5],[13,7,13,14],[13,15,13,36],[14,0,15,0],[14,3,14,5],[14,7,14,14],[14,15,14,36],[15,3,15,5],[15,7,15,14],[15,15,15,36],[16,3,16,5],[16,7,16,14],[16,15,16,36],[17,3,17,5],[17,7,17,14],[17,15,17,36],[18,3,18,5],[18,7,18,14],[18,15,18,36],[19,3,19,5],[19,7,19,14],[19,15,19,36],[20,3,20,5],[20,7,20,14],[20,15,20,36],[21,3,21,5],[21,7,21,14],[21,15,21,36],[22,3,22,5],[22,7,22,14],[22,15,22,36],[23,3,23,5],[23,7,23,14],[23,15,23,36],[24,3,24,5],[24,7,24,14],[24,15,24,36],[25,3,25,5],[25,7,25,14],[25,15,25,36],[26,3,26,5],[26,7,26,14],[26,15,26,36],[27,3,27,5],[27,7,27,14],[27,15,27,36],[28,3,28,5],[28,7,28,14],[28,15,28,36],[29,3,29,5],[29,7,29,14],[29,15,29,36]]}
[{"$nulls":7},{"$f":"Ajuda!E7","v":"III TAÇA DO DESPORTO ESCOLAR"}]
[null,null,"Equipa 3",{"$nulls":4},"FASE DA COMPETIÇÃO",{"$nulls":8},{"$f":"IF(H4=\"\",\"\",IF(H4=\"AGRUPAMENTO/ESCOLA\",\"AGRUPAMENTO/ESCOLA\",IF(H4=\"CLDE\",\"CLDE\",IF(H4=\"NACIONAL\",\"CLDE ORGANIZADORA\",\"\"))))","v":"CLDE"},{"$nulls":12},"ANO LETIVO"]
["AJUDA",null,"Equipa 3"]
[null,null,"Equipa 3",{"$nulls":4},"CLDE",{"$nulls":20},2017,{"$nulls":3},"/",{"$f":"IF(AC4=\"\",\"\",AC4+1)","v":2018}]
["DEFINIÇÕES",null,"Equipa 3"]
[{"$nulls":43},"NP",0,null,"NP",0]
["ATLETISMO",null,null,"Equipa 1",{"$nulls":3},{"$f":"IF(H4=\"Nacional\",\"Alentejo Central\",\"Equipa 1\")","v":"Equipa 1"},{"$nulls":33},{"$f":"IF(P7=\"\",\"\",IF($R$5=\"Nacional\",UPPER(P7)&\" (\"&H7&\")\",UPPER(P7)))","v":""},null,"1º",30,null,"1º",24]
[{"$nulls":3},"Equipa 2",{"$nulls":3},{"$f":"IF(H4=\"Nacional\",\"Algarve (CR)\",\"Equipa 2\")","v":"Equipa 2"},{"$nulls":33},"",null,"2º",26,null,"2º",23]
{"$rows_left_out":23}
{"sheet":"Atletismo","index":2,"n_rows":30,"n_cols":119,"rows_kept":30,"merged":[[0,2,0,12],[1,14,1,22],[1,24,1,32],[1,34,2,44],[1,46,1,54],[1,56,1,64],[1,66,2,76],[1,78,2,93],[2,0,3,0],[2,2,3,12],[2,14,2,16],[2,17,2,19],[2,20,2,22],[2,24,2,26],[2,27,2,29],[2,30,2,32],[2,46,2,48],[2,49,2,51],[2,52,2,54],[2,56,2,58],[2,59,2,61],[2,62,2,64],[2,95,2,96],[2,98,3,100],[3,34,3,36],[3,38,3,40],[3,42,3,44],[3,66,3,68],[3,70,3,72],[3,74,3,76],[3,78,3,79],[3,80,3,81],[3,83,3,85],[3,87,3,89],[3,91,3,93],[3,95,3,96],[4,0,5,0],[4,2,4,3],[4,4,4,12],[4,34,4,36],[4,38,4,40],[4,42,4,44],[4,66,4,68],[4,70,4,72],[4,74,4,76],[4,78,4,79],[4,80,4,81],[4,83,4,85],[4,87,4,89],[4,91,4,93],[4,95,4,96],[4,98,4,100],[5,2,5,3],[5,4,5,12],[5,34,5,36],[5,38,5,40],[5,42,5,44],[5,66,5,68],[5,70,5,72],[5,74,5,76],[5,78,5,79],[5,80,5,81],[5,83,5,85],[5,87,5,89],[5,91,5,93],[5,95,5,96],[5,98,5,100],[6,0,7,0],[6,2,6,3],[6,4,6,12],[6,34,6,36],[6,38,6,40],[6,42,6,44],[6,66,6,68],[6,70,6,72],[6,74,6,76],[6,78,6,79],[6,80,6,81],[6,83,6,85],[6,87,6,89],[6,91,6,93],[6,95,6,96],[6,98,6,100],[7,2,7,3],[7,4,7,12],[7,34,7,36],[7,38,7,40],[7,42,7,44],[7,66,7,68],[7,70,7,72],[7,74,7,76],[7,78,7,79],[7,80,7,81],[7,83,7,85],[7,87,7,89],[7,91,7,93],[7,95,7,96],[7,98,7,100],[8,0,9,0],[8,2,8,3],[8,4,8,12],[8,34,8,36],[8,38,8,40],[8,42,8,44],[8,66,8,68],[8,70,8,72],[8,74,8,76],[8,78,8,79],[8,80,8,81],[8,83,8,85],[8,87,8,89],[8,91,8,93],[8,95,8,96],[8,98,8,100],[9,2,9,3],[9,4,9,12],[9,34,9,36],[9,38,9,40],[9,42,9,44],[9,66,9,68],[9,70,9,72],[9,74,9,76],[9,78,9,79],[9,80,9,81],[9,83,9,85],[9,87,9,89],[9,91,9,93],[9,95,9,96],[9,98,9,100],[10,0,11,0],[10,2,10,3],[10,4,10,12],[10,34,10,36],[10,38,10,40],[10,42,10,44],[10,66,10,68],[10,70,10,72],[10,74,10,76],[10,78,10,79],[10,80,10,81],[10,83,10,85],[10,87,10,89],[10,91,10,93],[10,95,10,96],[10,98,10,100],[11,2,11,3],[11,4,11,12],[11,34,11,36],[11,38,11,40],[11,42,11,44],[11,66,11,68],[11,70,11,72],[11,74,11,76],[11,78,11,79],[11,80,11,81],[11,83,11,85],[11,87,11,89],[11,91,11,93],[11,95,11,96],[11,98,11,100],[12,2,12,3],[12,4,12,12],[12,34,12,36],[12,38,12,40],[12,42,12,44],[12,66,12,68],[12,70,12,72],[12,74,12,76],[12,78,12,79],[12,80,12,81],[12,83,12,85],[12,87,12,89],[12,91,12,93],[12,95,12,96],[12,98,12,100],[13,2,13,3],[13,4,13,12],[13,34,13,36],[13,38,13,40],[13,42,13,44],[13,66,13,68],[13,70,13,72],[13,74,13,76],[13,78,13,79],[13,80,13,81],[13,83,13,85],[13,87,13,89],[13,91,13,93],[13,95,13,96],[13,98,13,100],[14,0,15,0],[14,2,14,3],[14,4,14,12],[14,34,14,36],[14,38,14,40],[14,42,14,44],[14,66,14,68],[14,70,14,72],[14,74,14,76],[14,78,14,79],[14,80,14,81],[14,83,14,85],[14,87,14,89],[14,91,14,93],[14,95,14,96],[14,98,14,100],[15,2,15,3],[15,4,15,12],[15,34,15,36],[15,38,15,40],[15,42,15,44],[15,66,15,68],[15,70,15,72],[15,74,15,76],[15,78,15,79],[15,80,15,81],[15,83,15,85],[15,87,15,89],[15,91,15,93],[15,95,15,96],[15,98,15,100],[16,2,16,3],[16,4,16,12],[16,34,16,36],[16,38,16,40],[16,42,16,44],[16,66,16,68],[16,70,16,72],[16,74,16,76],[16,78,16,79],[16,80,16,81],[16,83,16,85],[16,87,16,89],[16,91,16,93],[16,95,16,96],[16,98,16,100],[17,2,17,3],[17,4,17,12],[17,34,17,36],[17,38,17,40],[17,42,17,44],[17,66,17,68],[17,70,17,72],[17,74,17,76],[17,78,17,79],[17,80,17,81],[17,83,17,85],[17,87,17,89],[17,91,17,93],[17,95,17,96],[17,98,17,100],[18,2,18,3],[18,4,18,12],[18,34,18,36],[18,38,18,40],[18,42,18,44],[18,66,18,68],[18,70,18,72],[18,74,18,76],[18,78,18,79],[18,80,18,81],[18,83,18,85],[18,87,18,89],[18,91,18,93],[18,95,18,96],[18,98,18,100],[19,2,19,3],[19,4,19,12],[19,34,19,36],[19,38,19,40],[19,42,19,44],[19,66,19,68],[19,70,19,72],[19,74,19,76],[19,78,19,79],[19,80,19,81],[19,83,19,85],[19,87,19,89],[19,91,19,93],[19,95,19,96],[19,98,19,100],[20,2,20,3],[20,4,20,12],[20,34,20,36],[20,38,20,40],[20,42,20,44],[20,66,20,68],[20,70,20,72],[20,74,20,76],[20,78,20,79],[20,80,20,81],[20,83,20,85],[20,87,20,89],[20,91,20,93],[20,95,20,96],[20,98,20,100],[21,2,21,3],[21,4,21,12],[21,34,21,36],[21,38,21,40],[21,42,21,44],[21,66,21,68],[21,70,21,72],[21,74,21,76],[21,78,21,79],[21,80,21,81],[21,83,21,85],[21,87,21,89],[21,91,21,93],[21,95,21,96],[21,98,21,100],[22,2,22,3],[22,4,22,12],[22,34,22,36],[22,38,22,40],[22,42,22,44],[22,66,22,68],[22,70,22,72],[22,74,22,76],[22,78,22,79],[22,80,22,81],[22,83,22,85],[22,87,22,89],[22,91,22,93],[22,95,22,96],[22,98,22,100],[23,2,23,3],[23,4,23,12],[23,34,23,36],[23,38,23,40],[23,42,23,44],[23,66,23,68],[23,70,23,72],[23,74,23,76],[23,78,23,79],[23,80,23,81],[23,83,23,85],[23,87,23,89],[23,91,23,93],[23,95,23,96],[23,98,23,100],[24,2,24,3],[24,4,24,12],[24,34,24,36],[24,38,24,40],[24,42,24,44],[24,66,24,68],[24,70,24,72],[24,74,24,76],[24,78,24,79],[24,80,24,81],[24,83,24,85],[24,87,24,89],[24,91,24,93],[24,95,24,96],[24,98,24,100],[25,2,25,3],[25,4,25,12],[25,34,25,36],[25,38,25,40],[25,42,25,44],[25,66,25,68],[25,70,25,72],[25,74,25,76],[25,78,25,79],[25,80,25,81],[25,83,25,85],[25,87,25,89],[25,91,25,93],[25,95,25,96],[25,98,25,100],[26,2,26,3],[26,4,26,12],[26,34,26,36],[26,38,26,40],[26,42,26,44],[26,66,26,68],[26,70,26,72],[26,74,26,76],[26,78,26,79],[26,80,26,81],[26,83,26,85],[26,87,26,89],[26,91,26,93],[26,95,26,96],[26,98,26,100],[27,2,27,3],[27,4,27,12],[27,34,27,36],[27,38,27,40],[27,42,27,44],[27,66,27,68],[27,70,27,72],[27,74,27,76],[27,78,27,79],[27,80,27,81],[27,83,27,85],[27,87,27,89],[27,91,27,93],[27,95,27,96],[27,98,27,100],[28,2,28,12],[29,2,29,12]]}
[null,null,{"$f":"Ajuda!E7","v":"III TAÇA DO DESPORTO ESCOLAR"}]
[{"$nulls":14},"Salto Masculino",{"$nulls":9},"Salto Feminino",{"$nulls":9},"Salto - Triplo Step",{"$nulls":11},"Lançamento Masculino",{"$nulls":9},"Lançamento Feminino",{"$nulls":9},"Lançamento - bola de ténis",{"$nulls":11},"Estafetas"]
["AJUDA",null,"Equipas",{"$nulls":11},"Aluno 1",null,null,"Aluno 2",null,null,"Aluno 3",{"$nulls":3},"Aluna 1",null,null,"Aluna 2",null,null,"Aluna 3",{"$nulls":15},"Aluno 1",null,null,"Aluno 2",null,null,"Aluno 3",{"$nulls":3},"Aluna 1",null,null,"Aluna 2",null,null,"Aluna 3",{"$nulls":32},"TOTAL",null,null,"CLASSIFICAÇÃO FINAL"]
[{"$nulls":14},"Salto 1","Salto 2","Salto 3","Salto 1","Salto 2","Salto 3","Salto 1","Salto 2","Salto 3",null,"Salto 1","Salto 2","Salto 3","Salto 1","Salto 2","Salto 3","Salto 1","Salto 2","Salto 3",null,"Resultado",{"$nulls":3},"Classificação",{"$nulls":3},"PONTOS",{"$nulls":3},"Lanç. 1","Lanç. 2","Lanç. 3","Lanç. 1","Lanç. 2","Lanç. 3","Lanç. 1","Lanç. 2","Lanç. 3",null,"Lanç. 1","Lanç. 2","Lanç. 3","Lanç. 1","Lanç. 2","Lanç. 3","Lanç. 1","Lanç. 2","Lanç. 3",null,"Resultado",{"$nulls":3},"Classificação",{"$nulls":3},"PONTOS",{"$nulls":3},"Estaf. 1",null,"Estaf. 2",null,null,"Resultado",{"$nulls":3},"Classificação",{"$nulls":3},"PONTOS",{"$nulls":3},"PONTOS"]
["DEFINIÇÕES",null,{"$f":"IF(Definições!P7=\"\",\"\",DO5)","v":""},null,{"$f":"Definições!AP7","v":""},{"$nulls":29},{"$f":"IFERROR(IF(OR(COUNTBLANK(CY5:DA5)>2,COUNTBLANK(DC5:DE5)>2),\"\",SUM(LARGE(CY5:DA5,1),LARGE(CY5:DA5,2),LARGE(DC5:DE5,1),LARGE(DC5:DE5,2))),\"\")","v":""},{"$nulls":3},{"$f":"IF(OR(COUNTIF(DC5:DE5,0)>1,COUNTIF(CY5:DA5,0)>1),\"DESCL.\",IF(COUNTBLANK(O5:AG5)=19,\"\",IF(AI5=\"\",\"DESCL.\",IF(AI5<>\"\",RANK(AI5,$AI$5:$AK$28,0)&\"º\",\"\"))))","v":""},{"$nulls":3},{"$f":"IF(AM5=\"DESCL.\",0,IF(AM5=\"\",\"\",VLOOKUP(AM5,Pontuação_Atl,2,FALSE)))","v":""},{"$nulls":23},{"$f":"IFERROR(IF(OR(COUNTBLANK(DG5:DI5)>2,COUNTBLANK(DK5:DM5)>2),\"\",SUM(LARGE(DG5:DI5,1),LARGE(DG5:DI5,2),LARGE(DK5:DM5,1),LARGE(DK5:DM5,2))),\"\")","v":""},{"$nulls":3},{"$f":"IF(OR(COUNTIF(DK5:DM5,0)>1,COUNTIF(DG5:DI5,0)>1),\"DESCL.\",IF(COUNTBLANK(AU5:BM5)=19,\"\",IF(BO5=\"\",\"DESCL.\",IF(BO5<>\"\",RANK(BO5,$BO$5:$BQ$28,0)&\"º\",\"\"))))","v":""},{"$nulls":3},{"$f":"IF(BS5=\"DESCL.\",0,IF(BS5=\"\",\"\",VLOOKUP(BS5,Pontuação_Atl,2,FALSE)))","v":""},{"$nulls":8},{"$f":"IF(OR(CA5=\"\",CA5=\"NP\",CC5=\"\",CC5=\"NP\"),\"\",SMALL(CA5:CD5,1))","v":""},{"$nulls":3},{"$f":"IF(AND(CA5=\"\",CC5=\"\"),\"\",IF(OR(CA5=\"NP\",CC5=\"NP\"),\"DESCL.\",IF(CF5<>\"\",RANK(CF5,$CF$5:$CH$28,1)&\"º\",\"\")))","v":""},{"$nulls":3},{"$f":"IF(CJ5=\"DESCL.\",0,IF(CJ5=\"\",\"\",VLOOKUP(CJ5,Pontuação_Atl,2,FALSE)))","v":""},{"$nulls":3},{"$f":"IF(OR(AM5=\"DESCL.\",BS5=\"DESCL.\",CJ5=\"DESCL.\"),\"DESCL.\",IF(OR(AQ5=\"\",BW5=\"\",CN5=\"\"),\"\",AQ5+BW5+CN5))","v":""},null,null,{"$f":"IF(CR5=\"DESCL.\",\"DESCL.\",IF(CR5=0,\"DESCL.\",IF(CR5<>\"\",RANK(CR5,$CR$5:$CS$28,0)&\"º\",\"\")))","v":""},{"$nulls":3},{"$f":"IF(COUNTBLANK(O5:Q5)=3,\"\",IF(COUNTIF(O5:Q5,\"NP\")>0,0,MAX(O5:Q5)))","v":""},{"$f":"IF(COUNTBLANK(R5:T5)=3,\"\",IF(COUNTIF(R5:T5,\"NP\")>0,0,MAX(R5:T5)))","v":""},{"$f":"IF(COUNTBLANK(U5:W5)=3,\"\",IF(COUNTIF(U5:W5,\"NP\")>0,0,MAX(U5:W5)))","v":""},null,{"$f":"IF(COUNTBLANK(Y5:AA5)=3,\"\",IF(COUNTIF(Y5:AA5,\"NP\")>0,0,MAX(Y5:AA5)))","v":""},{"$f":"IF(COUNTBLANK(AB5:AD5)=3,\"\",IF(COUNTIF(AB5:AD5,\"NP\")>0,0,MAX(AB5:AD5)))","v":""},{"$f":"IF(COUNTBLANK(AE5:AG5)=3,\"\",IF(COUNTIF(AE5:AG5,\"NP\")>0,0,MAX(AE5:AG5)))","v":""},null,{"$f":"IF(COUNTBLANK(AU5:AW5)=3,\"\",IF(COUNTIF(AU5:AW5,\"NP\")>0,0,MAX(AU5:AW5)))","v":""},{"$f":"IF(COUNTBLANK(AX5:AZ5)=3,\"\",IF(COUNTIF(AX5:AZ5,\"NP\")>0,0,MAX(AX5:AZ5)))","v":""},{"$f":"IF(COUNTBLANK(BA5:BC5)=3,\"\",IF(COUNTIF(BA5:BC5,\"NP\")>0,0,MAX(BA5:BC5)))","v":""},null,{"$f":"IF(COUNTBLANK(BE5:BG5)=3,\"\",IF(COUNTIF(BE5:BG5,\"NP\")>0,0,MAX(BE5:BG5)))","v":""},{"$f":"IF(COUNTBLANK(BH5:BJ5)=3,\"\",IF(COUNTIF(BH5:BJ5,\"NP\")>0,0,MAX(BH5:BJ5)))","v":""},{"$f":"IF(COUNTBLANK(BK5:BM5)=3,\"\",IF(COUNTIF(BK5:BM5,\"NP\")>0,0,MAX(BK5:BM5)))","v":""},null,1]
[null,null,{"$f":"IF(Definições!P8=\"\",\"\",DO6)","v":""},null,{"$f":"Definições!AP8","v":""},{"$nulls":29},{"$f":"IFERROR(IF(OR(COUNTBLANK(CY6:DA6)>2,COUNTBLANK(DC6:DE6)>2),\"\",SUM(LARGE(CY6:DA6,1),LARGE(CY6:DA6,2),LARGE(DC6:DE6,1),LARGE(DC6:DE6,2))),\"\")","v":""},{"$nulls":3},{"$f":"IF(OR(COUNTIF(DC6:DE6,0)>1,COUNTIF(CY6:DA6,0)>1),\"DESCL.\",IF(COUNTBLANK(O6:AG6)=19,\"\",IF(AI6=\"\",\"DESCL.\",IF(AI6<>\"\",RANK(AI6,$AI$5:$AK$28,0)&\"º\",\"\"))))","v":""},{"$nulls":3},"",{"$nulls":23},{"$f":"IFERROR(IF(OR(COUNTBLANK(DG6:DI6)>2,COUNTBLANK(DK6:DM6)>2),\"\",SUM(LARGE(DG6:DI6,1),LARGE(DG6:DI6,2),LARGE(DK6:DM6,1),LARGE(DK6:DM6,2))),\"\")","v":""},{"$nulls":3},"",{"$nulls":3},"",{"$nulls":8},{"$f":"IF(OR(CA6=\"\",CA6=\"NP\",CC6=\"\",CC6=\"NP\"),\"\",SMALL(CA6:CD6,1))","v":""},{"$nulls":3},"",{"$nulls":3},"",{"$nulls":3},"",null,null,"",{"$nulls":3},"","","",null,"","","",null,"","","",null,"","","",null,2]
["ATLETISMO",null,{"$f":"IF(Definições!P9=\"\",\"\",DO7)","v":""},null,{"$f":"Definições!AP9","v":""},{"$nulls":29},"",{"$nulls":3},"",{"$nulls":3},"",{"$nulls":23},"",{"$nulls":3},{"$f":"IF(OR(COUNTIF(DK7:DM7,0)>1,COUNTIF(DG7:DI7,0)>1),\"DESCL.\",IF(COUNTBLANK(AU7:BM7)=19,\"\",IF(BO7=\"\",\"DESCL.\",IF(BO7<>\"\",RANK(BO7,$BO$5:$BQ$28,0)&\"º\",\"\"))))","v":""},{"$nulls":3},"",{"$nulls":8},"",{"$nulls":3},"",{"$nulls":3},"",{"$nulls":3},"",null,null,"",{"$nulls":3},"","","",null,"","","",null,"","","",null,"","","",null,3]
[null,null,{"$f":"IF(Definições!P10=\"\",\"\",DO8)","v":""},null,{"$f":"Definições!AP10","v":""},{"$nulls":29},"",{"$nulls":3},"",{"$nulls":3},"",{"$nulls":23},"",{"$nulls":3},{"$f":"IF(OR(COUNTIF(DK8:DM8,0)>1,COUNTIF(DG8:DI8,0)>1),\"DESCL.\",IF(COUNTBLANK(AU8:BM8)=19,\"\",IF(BO8=\"\",\"DESCL.\",IF(BO8<>\"\",RANK(BO8,$BO$5:$BQ$28,0)&\"º\",\"\"))))","v":""},{"$nulls":3},"",{"$nulls":8},"",{"$nulls":3},"",{"$nulls":3},"",{"$nulls":3},"",null,null,"",{"$nulls":3},"","","",null,"","","",null,"","","",null,"","","",null,4]
{"$rows_left_out":23}
{"sheet":"Totais","index":3,"n_rows":31,"n_cols":72,"rows_kept":31,"merged":[[0,2,0,12],[2,0,3,0],[2,2,3,12],[2,14,2,15],[2,17,2,18],[2,20,2,22],[2,24,2,25],[2,27,2,28],[2,30,2,32],[2,34,2,35],[2,37,2,38],[2,40,3,40],[2,42,3,42],[4,0,5,0],[4,2,4,3],[4,4,4,12],[5,2,5,3],[5,4,5,12],[6,0,7,0],[6,2,6,3],[6,4,6,12],[7,2,7,3],[7,4,7,12],[8,0,9,0],[8,2,8,3],[8,4,8,12],[9,2,9,3],[9,4,9,12],[10,0,11,0],[10,2,10,3],[10,4,10,12],[11,2,11,3],[11,4,11,12],[12,2,12,3],[12,4,12,12],[13,2,13,3],[13,4,13,12],[14,0,15,0],[14,2,14,3],[14,4,14,12],[15,2,15,3],[15,4,15,12],[16,2,16,3],[16,4,16,12],[17,2,17,3],[17,4,17,12],[18,2,18,3],[18,4,18,12],[19,2,19,3],[19,4,19,12],[20,2,20,3],[20,4,20,12],[21,2,21,3],[21,4,21,12],[22,2,22,3],[22,4,22,12],[23,2,23,3],[23,4,23,12],[24,2,24,3],[24,4,24,12],[25,2,25,3],[25,4,25,12],[26,2,26,3],[26,4,26,12],[27,2,27,3],[27,4,27,12],[29,2,29,12],[30,2,30,3],[30,4,30,12]]}
[null,null,{"$f":"Ajuda!E7","v":"III TAÇA DO DESPORTO ESCOLAR"}]
[]
["AJUDA",null,"Equipas",{"$nulls":11},"Andebol Feminino",null,null,"Andebol Masculino",null,null,"Andebol",{"$nulls":3},"Basquetebol Feminino",null,null,"Basquetebol Masculino",null,null,"Basquetebol",{"$nulls":3},"Atletismo",null,null,"Ténis de Mesa",null,null,"TOTAL de PONTOS",null,"CLASSIFICAÇÃO FINAL"]
[{"$nulls":14},"classif.","pontos",null,"classif.","pontos",null,"TOTAL","Classif.","Pontos",null,"classif.","pontos",null,"classif.","pontos",null,"TOTAL","Classif.","Pontos",null,"classif.","pontos",null,"classif.","pontos",{"$nulls":9},"1º","2º","3º","4º","5º","6º","7º","8º","9º","10º","11º","12º","13º","14º","15º","16º","17º","18º","19º","20º","21º","22º","23º","24º"]
["DEFINIÇÕES",null,{"$f":"IF(Definições!P7=\"\",\"\",AT5)","v":""},null,{"$f":"Definições!AP7","v":""},{"$nulls":10},{"$f":"IF(O5=\"\",\"\",VLOOKUP(O5,Pontuação,2,FALSE))","v":""},null,null,{"$f":"IF(R5=\"\",\"\",VLOOKUP(R5,Pontuação,2,FALSE))","v":""},null,{"$f":"IF(OR(P5=\"\",S5=\"\"),\"\",P5+S5)","v":""},{"$f":"IF(OR(O5=\"NP\",R5=\"NP\"),\"DESCL.\",IF(U5<>\"\",RANK(U5,$U$5:$U$28,0)&\"º\",\"\"))","v":""},{"$f":"IF(V5=\"DESCL.\",0,IF(V5=\"\",\"\",VLOOKUP(V5,Pontuação,2,FALSE)))","v":""},null,null,{"$f":"IF(Y5=\"\",\"\",VLOOKUP(Y5,Pontuação,2,FALSE))","v":""},null,null,{"$f":"IF(AB5=\"\",\"\",VLOOKUP(AB5,Pontuação,2,FALSE))","v":""},null,{"$f":"IF(OR(Z5=\"\",AC5=\"\"),\"\",Z5+AC5)","v":""},{"$f":"IF(OR(Y5=\"NP\",AB5=\"NP\"),\"DESCL.\",IF(AE5<>\"\",RANK(AE5,$AE$5:$AE$28,0)&\"º\",\"\"))","v":""},{"$f":"IF(AF5=\"DESCL.\",0,IF(AF5=\"\",\"\",VLOOKUP(AF5,Pontuação,2,FALSE)))","v":""},null,{"$f":"Atletismo!CU5","v":""},{"$f":"IF(AI5=\"DESCL.\",0,IF(AI5=\"\",\"\",VLOOKUP(AI5,Pontuação,2,FALSE)))","v":""},null,null,{"$f":"IF(AL5=\"\",\"\",VLOOKUP(AL5,Pontuação,2,FALSE))","v":""},null,{"$f":"IF(AND(W5=\"\",AG5=\"\",AJ5=\"\",AM5=\"\"),\"\",SUM(IF(W5=\"\",0,W5)+IF(AG5=\"\",0,AG5)+IF(AJ5=\"\",0,AJ5)+IF(AM5=\"\",0,AM5))+AV5)","v":""},null,{"$f":"IF(OR(O5=\"NP\",R5=\"NP\",Y5=\"NP\",AB5=\"NP\",AI5=\"DESCL.\",AL5=\"NP\"),\"DESCL.\",IF(AO5<>\"\",RANK(AS7,$AS$7:$AS$30,0)&\"º\",\"\"))","v":""},null,null,1,null,{"$f":"0.01*AW5+0.001*AX5+0.0001*AY5+0.00001*AZ5+0.000001*BA5+0.0000001*BB5+0.00000001*BC5+0.000000001*BD5+0.0000000001*BE5+0.00000000001*BF5+0.000000000001*BG5+0.0000000000001*BH5+0.00000000000001*BI5+0.000000000000001*BJ5+0.0000000000000001*BK5+0.00000000000000001*BL5+0.000000000000000001*BM5+0.0000000000000000001*BN5+1E-20*BO5+1E-21*BP5+1E-22*BQ5+1E-23*BR5+1E-24*BS5+1E-25*BT5","v":{"v":0,"d":"0.00"}},{"$f":"COUNTIF($O5:$AM5,AW$4)","v":0},0,0,0,0,0,0,0,0,0,{"$f":"COUNTIF($O5:$AM5,BG$4)","v":0},0,0,0,0,0,0,0,0,0,0,0,0,0]
[null,null,{"$f":"IF(Definições!P8=\"\",\"\",AT6)","v":""},null,{"$f":"Definições!AP8","v":""},{"$nulls":10},"",null,null,"",null,"",{"$f":"IF(OR(O6=\"NP\",R6=\"NP\"),\"DESCL.\",IF(U6<>\"\",RANK(U6,$U$5:$U$28,0)&\"º\",\"\"))","v":""},"",null,null,"",null,null,"",null,{"$f":"IF(OR(Z6=\"\",AC6=\"\"),\"\",Z6+AC6)","v":""},{"$f":"IF(OR(Y6=\"NP\",AB6=\"NP\"),\"DESCL.\",IF(AE6<>\"\",RANK(AE6,$AE$5:$AE$28,0)&\"º\",\"\"))","v":""},"",null,{"$f":"Atletismo!CU6","v":""},"",null,null,"",null,{"$f":"IF(AND(W6=\"\",AG6=\"\",AJ6=\"\",AM6=\"\"),\"\",SUM(IF(W6=\"\",0,W6)+IF(AG6=\"\",0,AG6)+IF(AJ6=\"\",0,AJ6)+IF(AM6=\"\",0,AM6))+AV6)","v":""},null,"",null,null,2,null,{"$f":"0.01*AW6+0.001*AX6+0.0001*AY6+0.00001*AZ6+0.000001*BA6+0.0000001*BB6+0.00000001*BC6+0.000000001*BD6+0.0000000001*BE6+0.00000000001*BF6+0.000000000001*BG6+0.0000000000001*BH6+0.00000000000001*BI6+0.000000000000001*BJ6+0.0000000000000001*BK6+0.00000000000000001*BL6+0.000000000000000001*BM6+0.0000000000000000001*BN6+1E-20*BO6+1E-21*BP6+1E-22*BQ6+1E-23*BR6+1E-24*BS6+1E-25*BT6","v":{"v":0,"d":"0.00"}},0,0,0,0,0,0,0,0,0,0,0,0,0,0,0,0,0,0,0,0,0,0,0,0]
["ATLETISMO",null,{"$f":"IF(Definições!P9=\"\",\"\",AT7)","v":""},null,{"$f":"Definições!AP9","v":""},{"$nulls":10},"",null,null,"",null,"","","",null,null,"",null,null,"",null,"","","",null,{"$f":"Atletismo!CU7","v":""},"",null,null,"",null,"",null,"",null,{"$f":"IF(AO5=\"\",\"\",AO5+AV5)","v":""},3,null,{"v":0,"d":"0.00"},0,0,0,0,0,0,0,0,0,0,0,0,0,0,0,0,0,0,0,0,0,0,0,0]
[null,null,{"$f":"IF(Definições!P10=\"\",\"\",AT8)","v":""},null,{"$f":"Definições!AP10","v":""},{"$nulls":10},"",null,null,"",null,"","","",null,null,"",null,null,"",null,"","","",null,{"$f":"Atletismo!CU8","v":""},"",null,null,"",null,"",null,"",null,"",4,null,{"v":0,"d":"0.00"},0,0,0,0,0,0,0,0,0,0,0,0,0,0,0,0,0,0,0,0,0,0,0,0]
{"$rows_left_out":24}
{"sheet":"Classif. Final","index":4,"n_rows":30,"n_cols":45,"rows_kept":30,"merged":[[0,2,0,12],[0,13,0,16],[0,17,0,22],[0,23,0,25],[1,2,2,11],[1,13,1,14],[1,16,1,17],[1,19,1,20],[1,22,1,23],[1,28,2,28],[1,29,1,30],[1,31,1,32],[1,33,1,34],[1,35,1,36],[2,0,3,0],[3,3,3,11],[4,0,5,0],[4,3,4,11],[5,3,5,11],[6,0,7,0],[6,3,6,11],[7,3,7,11],[8,0,9,0],[8,3,8,11],[9,3,9,11],[10,0,11,0],[10,3,10,11],[11,3,11,11],[12,3,12,11],[13,3,13,11],[14,0,15,0],[14,3,14,11],[15,3,15,11],[16,3,16,11],[17,3,17,11],[18,3,18,11],[19,3,19,11],[20,3,20,11],[21,3,21,11],[22,3,22,11],[23,3,23,11],[24,3,24,11],[25,3,25,11],[26,3,26,11],[27,0,27,12],[29,3,29,11]]}
[null,null,{"$f":"Ajuda!E7","v":"III TAÇA DO DESPORTO ESCOLAR"},{"$nulls":10},{"$f":"IF(Definições!$H$4=\"\",\"\",\"Fase \"&Definições!$H$4)","v":"Fase CLDE"},{"$nulls":3},{"$f":"IF(Definições!$Q$4=\"\",\"\",IF(OR(Definições!Q2=\"CLDE\",Definições!Q2=\"CLDE Organizadora\"),\"Organização: CLDE \"&Definições!$Q$4,\"Local: \"&Definições!$Q$4))","v":""},{"$nulls":5},{"$f":"IF(Definições!$AC$4=\"\",\"\",\"Ano letivo \"&Definições!$AC$4&\"/\"&Definições!$AH$4)","v":"Ano letivo 2017/2018"}]
[null,null,"Equipas",{"$nulls":10},"Andebol",null,null,"Basquetebol",null,null,"Atletismo",null,null,"Ténis de Mesa",null,null,"TOTAL",null,null,"CLASSIFICAÇÃO FINAL","Andebol",null,"Basquetebol",null,"Atletismo",null,"Ténis de Mesa",null,"TOTAL"]
["AJUDA",{"$nulls":12},"Classif.","Pontos",null,"Classif.","Pontos",null,"classif.","pontos",null,"classif.","pontos",null,"PONTOS",{"$nulls":3},"Classif.","Pontos","Classif.","Pontos","classif.","pontos","classif.","pontos","PONTOS"]
[null,null,{"$f":"IF($AO$4<AN4,\"\",AN4&\"º\")","v":""},{"$f":"IF(C4=\"\",\"\",VLOOKUP(C4,$AC$4:$AM$27,11,FALSE))","v":""},{"$nulls":9},{"$f":"IFERROR(VLOOKUP(C4,$AC$4:$AM$27,2,FALSE),\"\")","v":""},{"$f":"IFERROR(VLOOKUP(C4,$AC$4:$AM$27,3,FALSE),\"\")","v":""},null,{"$f":"IFERROR(VLOOKUP(C4,$AC$4:$AM$27,4,FALSE),\"\")","v":""},{"$f":"IFERROR(VLOOKUP(C4,$AC$4:$AM$27,5,FALSE),\"\")","v":""},null,{"$f":"IFERROR(VLOOKUP(C4,$AC$4:$AM$27,6,FALSE),\"\")","v":""},{"$f":"IFERROR(VLOOKUP(C4,$AC$4:$AM$27,7,FALSE),\"\")","v":""},null,{"$f":"IFERROR(VLOOKUP(C4,$AC$4:$AM$27,8,FALSE),\"\")","v":""},{"$f":"IFERROR(VLOOKUP(C4,$AC$4:$AM$27,9,FALSE),\"\")","v":""},null,{"$f":"IFERROR(VLOOKUP(C4,$AC$4:$AM$27,10,FALSE),\"\")","v":""},{"$f":"IF(AND(VLOOKUP(C4,$AC$4:$AP$27,14,FALSE)<1000,VLOOKUP(C4,$AC$4:$AP$27,14,FALSE)<>\"\"),\"*\",\"\")","v":""},null,{"$f":"IF(AP4=\"\",\"\",RANK(AP4,$AP$4:$AP$27)&\"º\")","v":""},{"$f":"Totais!V5","v":""},{"$f":"Totais!W5","v":""},{"$f":"Totais!AF5","v":""},{"$f":"Totais!AG5","v":""},{"$f":"Totais!AI5","v":""},{"$f":"Totais!AJ5","v":""},{"$f":"IF(Totais!AL5=0,\"\",Totais!AL5)","v":""},{"$f":"Totais!AM5","v":""},{"$f":"Totais!AO5","v":""},{"$f":"Definições!AP7","v":""},1,{"$f":"24-COUNTBLANK(AL4:AL27)","v":0},{"$f":"IF(AL4=\"\",\"\",AL4+(IF(Totais!AQ5=\"DESCL.\",0,1000)))","v":""}]
["DEFINIÇÕES",null,{"$f":"IF($AO$4<AN5,\"\",AN5&\"º\")","v":""},"",{"$nulls":9},{"$f":"IFERROR(VLOOKUP(C5,$AC$4:$AM$27,2,FALSE),\"\")","v":""},{"$f":"IFERROR(VLOOKUP(C5,$AC$4:$AM$27,3,FALSE),\"\")","v":""},null,{"$f":"IFERROR(VLOOKUP(C5,$AC$4:$AM$27,4,FALSE),\"\")","v":""},{"$f":"IFERROR(VLOOKUP(C5,$AC$4:$AM$27,5,FALSE),\"\")","v":""},null,{"$f":"IFERROR(VLOOKUP(C5,$AC$4:$AM$27,6,FALSE),\"\")","v":""},{"$f":"IFERROR(VLOOKUP(C5,$AC$4:$AM$27,7,FALSE),\"\")","v":""},null,{"$f":"IFERROR(VLOOKUP(C5,$AC$4:$AM$27,8,FALSE),\"\")","v":""},{"$f":"IFERROR(VLOOKUP(C5,$AC$4:$AM$27,9,FALSE),\"\")","v":""},null,{"$f":"IFERROR(VLOOKUP(C5,$AC$4:$AM$27,10,FALSE),\"\")","v":""},{"$f":"IF(AND(VLOOKUP(C5,$AC$4:$AP$27,14,FALSE)<1000,VLOOKUP(C5,$AC$4:$AP$27,14,FALSE)<>\"\"),\"*\",\"\")","v":""},null,{"$f":"IF(AP5=\"\",\"\",RANK(AP5,$AP$4:$AP$27)&\"º\")","v":""},{"$f":"Totais!V6","v":""},{"$f":"Totais!W6","v":""},{"$f":"Totais!AF6","v":""},{"$f":"Totais!AG6","v":""},{"$f":"Totais!AI6","v":""},{"$f":"Totais!AJ6","v":""},{"$f":"IF(Totais!AL6=0,\"\",Totais!AL6)","v":""},{"$f":"Totais!AM6","v":""},{"$f":"Totais!AO6","v":""},{"$f":"Definições!AP8","v":""},2,null,{"$f":"IF(AL5=\"\",\"\",AL5+(IF(Totais!AQ6=\"DESCL.\",0,1000)))","v":""}]
[null,null,"","",{"$nulls":9},"","",null,"","",null,"","",null,"","",null,"","",null,"",{"$f":"Totais!V7","v":""},{"$f":"Totais!W7","v":""},{"$f":"Totais!AF7","v":""},{"$f":"Totais!AG7","v":""},{"$f":"Totais!AI7","v":""},{"$f":"Totais!AJ7","v":""},{"$f":"IF(Totais!AL7=0,\"\",Totais!AL7)","v":""},{"$f":"Totais!AM7","v":""},{"$f":"Totais!AO7","v":""},{"$f":"Definições!AP9","v":""},3,null,{"$f":"IF(AL6=\"\",\"\",AL6+(IF(Totais!AQ7=\"DESCL.\",0,1000)))","v":""}]
["ATLETISMO",null,"","",{"$nulls":9},"","",null,"","",null,"","",null,"","",null,"","",null,"",{"$f":"Totais!V8","v":""},{"$f":"Totais!W8","v":""},{"$f":"Totais!AF8","v":""},{"$f":"Totais!AG8","v":""},{"$f":"Totais!AI8","v":""},{"$f":"Totais!AJ8","v":""},{"$f":"IF(Totais!AL8=0,\"\",Totais!AL8)","v":""},{"$f":"Totais!AM8","v":""},{"$f":"Totais!AO8","v":""},{"$f":"Definições!AP10","v":""},4,null,{"$f":"IF(AL7=\"\",\"\",AL7+(IF(Totais!AQ8=\"DESCL.\",0,1000)))","v":""}]
[null,null,"","",{"$nulls":9},"","",null,"","",null,"","",null,"","",null,"","",null,"",{"$f":"Totais!V9","v":""},{"$f":"Totais!W9","v":""},{"$f":"Totais!AF9","v":""},{"$f":"Totais!AG9","v":""},{"$f":"Totais!AI9","v":""},{"$f":"Totais!AJ9","v":""},{"$f":"IF(Totais!AL9=0,\"\",Totais!AL9)","v":""},{"$f":"Totais!AM9","v":""},{"$f":"Totais!AO9","v":""},{"$f":"Definições!AP11","v":""},5,null,{"$f":"IF(AL8=\"\",\"\",AL8+(IF(Totais!AQ9=\"DESCL.\",0,1000)))","v":""}]
{"$rows_left_out":23}
{"sheet":"Folha1","index":5,"n_rows":11,"n_cols":3,"rows_kept":11,"hidden":true}
[]
[null,2015,"I"]
[null,2016,"II"]
[null,2017,"III"]
[null,2018,"IV"]
[null,2019,"V"]
[null,2020,"VI"]
[null,2021,"VII"]
{"$rows_left_out":3}